Reaction Details
TargetMuscarinic acetylcholine receptor M2
LigandBDBM50103771
Substrate/Competitorn/a
Meas. Tech.ChEMBL_139752 (CHEMBL745193)
Ki 0.140000±n/a nM
Citation Boyle, CDChackalamannil, SClader, JWGreenlee, WJJosien, HBKaminski, JJKozlowski, JAMcCombie, SWNazareno, DVTagat, JRWang, YZhou, GBillard, WBinch, HCrosby, GCohen-Williams, MCoffin, VLCox, KAGrotz, DEDuffy, RARuperto, VLachowicz, JE Metabolic stabilization of benzylidene ketal M(2) muscarinic receptor antagonists via halonaphthoic acid substitution. Bioorg Med Chem Lett11:2311-4 (2001) Muscarinic acetylcholine receptor M2
Name:Muscarinic acetylcholine receptor M2
Type:GPCR
Mol. Mass.:51730.61
Organism:Homo sapiens (Human)
Description:P08172
Residue:466
BDBM50103771
NameBDBM50103771
Synonyms:(4-{2-[4-(4-Methoxy-benzenesulfonyl)-phenyl]-[1,3]dioxolan-2-yl}-[1,4']bipiperidinyl-1'-yl)-naphthalen-1-yl-methanone | CHEMBL305693
TypeSmall organic molecule
Emp. Form.C37H40N2O6S
Mol. Mass.640.788
SMILESCOc1ccc(cc1)S(=O)(=O)c1ccc(cc1)C1(OCCO1)C1CCN(CC1)C1CCN(CC1)C(=O)c1cccc2ccccc12