Reaction Details
TargetD(2) dopamine receptor
LigandBDBM50020174
Substrate/Competitorn/a
Meas. Tech.ChEBML_61118
Ki 0.420000±n/a nM
Citation Feenstra, RWde Moes, JHofma, JJKling, HKuipers, WLong, SKTulp, MTvan der Heyden, JAKruse, CG New 1-aryl-4-(biarylmethylene)piperazines as potential atypical antipsychotics sharing dopamine D(2)-receptor and serotonin 5-HT(1A)-receptor affinities. Bioorg Med Chem Lett11:2345-9 (2001) D(2) dopamine receptor
Name:D(2) dopamine receptor
Type:Cell-surface receptors
Mol. Mass.:50647.10
Organism:Homo sapiens (Human)
Description:P14416
Residue:443
BDBM50020174
NameBDBM50020174
Synonyms:1-Benzofuran-7-yl-4-[5-(4-fluoro-phenyl)-1H-pyrrol-2-ylmethyl]-piperazine Elopiprazole
TypeSmall organic molecule
Emp. Form.C23H22FN3O
Mol. Mass.375.4387
SMILESFc1ccc(cc1)-c1ccc(CN2CCN(CC2)c2cccc3ccoc23)[nH]1