Reaction Details
TargetD(2) dopamine receptor
LigandBDBM50103839
Substrate/Competitorn/a
Meas. Tech.ChEBML_61118
Ki 0.470000±n/a nM
Citation Feenstra, RWde Moes, JHofma, JJKling, HKuipers, WLong, SKTulp, MTvan der Heyden, JAKruse, CG New 1-aryl-4-(biarylmethylene)piperazines as potential atypical antipsychotics sharing dopamine D(2)-receptor and serotonin 5-HT(1A)-receptor affinities. Bioorg Med Chem Lett11:2345-9 (2001) D(2) dopamine receptor
Name:D(2) dopamine receptor
Type:Cell-surface receptors
Mol. Mass.:50647.10
Organism:Homo sapiens (Human)
Description:P14416
Residue:443
BDBM50103839
NameBDBM50103839
Synonyms:7-{4-[4-(4-Fluoro-phenyl)-pyridin-2-ylmethyl]-piperazin-1-yl}-3H-benzooxazol-2-one | CHEMBL308345
TypeSmall organic molecule
Emp. Form.C23H21FN4O2
Mol. Mass.404.4368
SMILESFc1ccc(cc1)-c1ccnc(CN2CCN(CC2)c2cccc3[nH]c(=O)oc23)c1