Reaction Details
TargetPeroxisome proliferator-activated receptor alpha
LigandBDBM50103945
Substrate/Competitorn/a
Meas. Tech.ChEMBL_153237 (CHEMBL764649)
EC50 400±n/a nM
Citation Liu, KGSmith, JSAyscue, AHHenke, BRLambert, MHLeesnitzer, LMPlunket, KDWillson, TMSternbach, DD Identification of a series of oxadiazole-substituted alpha-isopropoxy phenylpropanoic acids with activity on PPARalpha, PPARgamma, and PPARdelta. Bioorg Med Chem Lett11:2385-8 (2001) Peroxisome proliferator-activated receptor alpha
Name:Peroxisome proliferator-activated receptor alpha
Type:Enzyme
Mol. Mass.:52222.08
Organism:Homo sapiens (Human)
Description:Q07869
Residue:468
BDBM50103945
NameBDBM50103945
Synonyms:2-Isopropoxy-3-(4-{2-[5-(2-trifluoromethyl-phenyl)-[1,2,4]oxadiazol-3-yl]-ethoxy}-phenyl)-propionic acid CHEMBL433316
TypeSmall organic molecule
Emp. Form.C23H23F3N2O5
Mol. Mass.464.4343
SMILESCC(C)OC(Cc1ccc(OCCc2noc(n2)-c2ccccc2C(F)(F)F)cc1)C(O)=O