Reaction Details
TargetAdenosine kinase
LigandBDBM50100587
Substrate/Competitorn/a
Meas. Tech.ChEBML_31126
IC50 2000±n/a nM
Citation Lee, CHDaanen, JFJiang, MYu, HKohlhaas, KLAlexander, KJarvis, MFKowaluk, ELBhagwat, SS Synthesis and biological evaluation of clitocine analogues as adenosine kinase inhibitors. Bioorg Med Chem Lett11:2419-22 (2001) Adenosine kinase
Name:Adenosine kinase
Type:Enzyme
Mol. Mass.:40130.14
Organism:Rattus norvegicus (rat)
Description:Rat brain cytosol as enzyme source.
Residue:361
BDBM50100587
NameBDBM50100587
Synonyms:(2R,3R,4S,5R)-2-(6-Amino-5-nitro-pyrimidin-4-ylamino)-5-hydroxymethyl-tetrahydro-furan-3,4-diol CHEMBL304179
TypeSmall organic molecule
Emp. Form.C9H13N5O6
Mol. Mass.287.2294
SMILESNc1ncnc(N[C@@H]2O[C@H](CO)[C@@H](O)[C@H]2O)c1[N+]([O-])=O