Reaction Details
TargetTyrosine--tRNA ligase, cytoplasmic
LigandBDBM50104310
Substrate/Competitorn/a
Meas. Tech.ChEBML_211023
IC50 124±n/a nM
Citation Jarvest, RLBerge, JMHouge-Frydrych, CSMensah, LMO'Hanlon, PJPope, AJ Inhibitors of bacterial tyrosyl tRNA synthetase: synthesis of carbocyclic analogues of the natural product SB-219383. Bioorg Med Chem Lett11:2499-502 (2001) Tyrosine--tRNA ligase, cytoplasmic
Name:Tyrosine--tRNA ligase, cytoplasmic
Type:PROTEIN
Mol. Mass.:59145.78
Organism:Homo sapiens (Human)
Description:ChEMBL_211030
Residue:528
BDBM50104310
NameBDBM50104310
Synonyms:(R)-[(S)-2-Amino-3-(4-hydroxy-phenyl)-propionylamino]-((1S,4S,5S,6S)-4,5,6-trihydroxy-cyclohex-2-enyl)-acetic acid ethyl ester | CHEMBL82579
TypeSmall organic molecule
Emp. Form.C19H26N2O7
Mol. Mass.394.4189
SMILESCCOC(=O)[C@H](NC(=O)[C@@H](N)Cc1ccc(O)cc1)[C@@H]1C=C[C@H](O)[C@H](O)[C@H]1O