Reaction Details
TargetTyrosine--tRNA ligase, cytoplasmic
LigandBDBM18128
Substrate/Competitorn/a
Meas. Tech.ChEBML_211023
IC50 0.600000±n/a nM
Citation Jarvest, RLBerge, JMHouge-Frydrych, CSMensah, LMO'Hanlon, PJPope, AJ Inhibitors of bacterial tyrosyl tRNA synthetase: synthesis of carbocyclic analogues of the natural product SB-219383. Bioorg Med Chem Lett11:2499-502 (2001) Tyrosine--tRNA ligase, cytoplasmic
Name:Tyrosine--tRNA ligase, cytoplasmic
Type:PROTEIN
Mol. Mass.:59145.78
Organism:Homo sapiens (Human)
Description:ChEMBL_211030
Residue:528
BDBM18128
NameBDBM18128
Synonyms:(2S)-2-[(2S)-2-amino-3-(4-hydroxyphenyl)propanamido]-2-[(1S,3S,4S,5R,8R)-2,4,5,8-tetrahydroxy-7-oxa-2-azabicyclo[3.2.1]octan-3-yl]acetic acid SB-219383
TypeSmall organic molecule
Emp. Form.C17H23N3O9
Mol. Mass.413.3792
SMILES[H][C@]1([C@H](NC(=O)[C@@H](N)Cc2ccc(O)cc2)C(O)=O)[C@H](O)[C@]2(O)CO[C@@H]([C@@H]2O)N1O