Reaction Details
TargetTelomerase reverse transcriptase
LigandBDBM50104473
Substrate/Competitorn/a
Meas. Tech.ChEBML_210074
IC50 9500±n/a nM
Citation Sasaki, SEhara, TAlam, MRFujino, YHarada, NKimura, JNakamura, HMaeda, M Solid-Phase synthesis of a library constructed of aromatic phosphate, long alkyl chains and tryptophane components, and identification of potent dipeptide telomerase inhibitors. Bioorg Med Chem Lett11:2581-4 (2001) Telomerase reverse transcriptase
Name:Telomerase reverse transcriptase
Type:PROTEIN
Mol. Mass.:127099.03
Organism:Homo sapiens (Human)
Description:ChEMBL_1447029
Residue:1132
BDBM50104473
NameBDBM50104473
Synonyms:(R)-2-[(R)-1-{12-[(2-Chloro-phenoxy)-hydroxy-phosphoryloxy]-dodecylcarbamoyl}-2-(1H-indol-3-yl)-ethylcarbamoyl]-pyrrolidine-1-carboxylic acid tert-butyl ester; compound with triethyl-amine | CHEMBL86984
TypeSmall organic molecule
Emp. Form.C39H56ClN4O8P
Mol. Mass.775.311
SMILESCC(C)(C)OC(=O)N1CCC[C@@H]1C(=O)N[C@H](Cc1c[nH]c2ccccc12)C(=O)NCCCCCCCCCCCCOP(O)(=O)Oc1ccccc1Cl