Reaction Details
TargetTelomerase reverse transcriptase
LigandBDBM50104485
Substrate/Competitorn/a
Meas. Tech.ChEBML_210074
IC50 33900±n/a nM
Citation Sasaki, SEhara, TAlam, MRFujino, YHarada, NKimura, JNakamura, HMaeda, M Solid-Phase synthesis of a library constructed of aromatic phosphate, long alkyl chains and tryptophane components, and identification of potent dipeptide telomerase inhibitors. Bioorg Med Chem Lett11:2581-4 (2001) Telomerase reverse transcriptase
Name:Telomerase reverse transcriptase
Type:PROTEIN
Mol. Mass.:127099.03
Organism:Homo sapiens (Human)
Description:ChEMBL_1447029
Residue:1132
BDBM50104485
NameBDBM50104485
Synonyms:CHEMBL86349 | Phosphoric acid 2-chloro-phenyl ester 12-(2-1H-indol-3-yl-acetylamino)-dodecyl ester; compound with triethyl-amine
TypeSmall organic molecule
Emp. Form.C28H38ClN2O5P
Mol. Mass.549.038
SMILESOP(=O)(OCCCCCCCCCCCCNC(=O)Cc1c[nH]c2ccccc12)Oc1ccccc1Cl