Reaction Details
TargetInterstitial collagenase
LigandBDBM50089194
Substrate/Competitorn/a
Meas. Tech.ChEBML_106445
IC50 1100±n/a nM
Citation Pratt, LMBeckett, RPDavies, SJLaunchbury, SBMiller, ASpavold, ZMTodd, RSWhittaker, M Asymmetric synthesis of BB-3497--a potent peptide deformylase inhibitor. Bioorg Med Chem Lett11:2585-8 (2001) Interstitial collagenase
Name:Interstitial collagenase
Type:Enzyme
Mol. Mass.:54010.26
Organism:Homo sapiens (Human)
Description: P03956
Residue:469
BDBM50089194
NameBDBM50089194
Synonyms:(R)-N*4*-Hydroxy-N*1*-[(S)-1-((S)-2-hydroxymethyl-pyrrolidine-1-carbonyl)-2-methyl-propyl]-2-pentyl-succinamide ACTINONIN N*4*-Hydroxy-N*1*-[(S)-1-((S)-2-hydroxymethyl-pyrrolidine-1-carbonyl)-2-methyl-propyl]-2-(R)-pentyl-succinamide | N*4*-Hydroxy-N*1*-[1-(2-hydroxymethyl-pyrrolidine-1-carbonyl)-2-methyl-propyl]-2-pentyl-succinamide
TypeSmall organic molecule
Emp. Form.C19H35N3O5
Mol. Mass.385.4983
SMILESCCCCC[C@H](CC(=O)NO)C(=O)N[C@@H](C(C)C)C(=O)N1CCC[C@H]1CO