Reaction Details
TargetM-phase inducer phosphatase 2
LigandBDBM50104681
Substrate/Competitorn/a
Meas. Tech.ChEMBL_49038 (CHEMBL662076)
IC50 1400±n/a nM
Citation Sodeoka, MSampe, RKojima, SBaba, YUsui, TUeda, KOsada, H Synthesis of a tetronic acid library focused on inhibitors of tyrosine and dual-specificity protein phosphatases and its evaluation regarding VHR and cdc25B inhibition. J Med Chem44:3216-22 (2001) M-phase inducer phosphatase 2
Name:M-phase inducer phosphatase 2
Type:PROTEIN
Mol. Mass.:65485.87
Organism:Mus musculus
Description:ChEMBL_49038
Residue:576
BDBM50104681
NameBDBM50104681
Synonyms:CHEMBL109357 | Methanesulfonic acid 4-hexadecanoyl-3-hydroxy-5-oxo-2,5-dihydro-furan-2-ylmethyl ester
TypeSmall organic molecule
Emp. Form.C22H38O7S
Mol. Mass.446.598
(=O)c1c(O)oc(COS(C)(=O)=O)c1O