Reaction Details
TargetM-phase inducer phosphatase 2
LigandBDBM50104693
Substrate/Competitorn/a
Meas. Tech.ChEMBL_49038 (CHEMBL662076)
IC50 900±n/a nM
Citation Sodeoka, MSampe, RKojima, SBaba, YUsui, TUeda, KOsada, H Synthesis of a tetronic acid library focused on inhibitors of tyrosine and dual-specificity protein phosphatases and its evaluation regarding VHR and cdc25B inhibition. J Med Chem44:3216-22 (2001) M-phase inducer phosphatase 2
Name:M-phase inducer phosphatase 2
Type:PROTEIN
Mol. Mass.:65485.87
Organism:Mus musculus
Description:ChEMBL_49038
Residue:576
BDBM50104693
NameBDBM50104693
Synonyms:4-Hydroxy-5-hydroxymethyl-3-octadec-9-enoyl-5H-furan-2-one | CHEMBL108394
TypeSmall organic molecule
Emp. Form.C23H38O5
Mol. Mass.394.5448
SMILESCCCCCCCC\C=C\CCCCCCCC(=O)c1c(O)oc(CO)c1O