Reaction Details
TargetMatrix metalloproteinase-14
LigandBDBM50104717
Substrate/Competitorn/a
Meas. Tech.ChEMBL_106783 (CHEMBL718390)
Ki 390±n/a nM
Citation Schröder, JHenke, AWenzel, HBrandstetter, HStammler, HGStammler, APfeiffer, WDTschesche, H Structure-based design and synthesis of potent matrix metalloproteinase inhibitors derived from a 6H-1,3,4-thiadiazine scaffold. J Med Chem44:3231-43 (2001) Matrix metalloproteinase-14
Name:Matrix metalloproteinase-14
Type:Protein
Mol. Mass.:65900.19
Organism:Homo sapiens (Human)
Description:P50281
Residue:582
BDBM50104717
NameBDBM50104717
Synonyms:(R)-N-(5-(4-fluorophenyl)-6H-1,3,4-thiadiazin-2-yl)-2-(phenylsulfonamido)propanamide CHEMBL322795
TypeSmall organic molecule
Emp. Form.C18H17FN4O3S2
Mol. Mass.420.481
SMILESC[C@@H](NS(=O)(=O)c1ccccc1)C(=O)NC1=NN=C(CS1)c1ccc(F)cc1