Reaction Details
TargetMatrix metalloproteinase-14
LigandBDBM50104715
Substrate/Competitorn/a
Meas. Tech.ChEMBL_106784 (CHEMBL718391)
Ki 390±n/a nM
Citation Schröder, JHenke, AWenzel, HBrandstetter, HStammler, HGStammler, APfeiffer, WDTschesche, H Structure-based design and synthesis of potent matrix metalloproteinase inhibitors derived from a 6H-1,3,4-thiadiazine scaffold. J Med Chem44:3231-43 (2001) Matrix metalloproteinase-14
Name:Matrix metalloproteinase-14
Type:Protein
Mol. Mass.:65900.19
Organism:Homo sapiens (Human)
Description:P50281
Residue:582
BDBM50104715
NameBDBM50104715
Synonyms:(S)-2-(phenylsulfonamido)-N-(5-(4-(trifluoromethyl)phenyl)-6H-1,3,4-thiadiazin-2-yl)propanamide CHEMBL109770
TypeSmall organic molecule
Emp. Form.C19H17F3N4O3S2
Mol. Mass.470.488
SMILESC[C@H](NS(=O)(=O)c1ccccc1)C(=O)NC1=NN=C(CS1)c1ccc(cc1)C(F)(F)F