Reaction Details
TargetMatrix metalloproteinase-9
LigandBDBM50104708
Substrate/Competitorn/a
Meas. Tech.ChEMBL_105381 (CHEMBL710801)
Ki 320±n/a nM
Citation Schröder, JHenke, AWenzel, HBrandstetter, HStammler, HGStammler, APfeiffer, WDTschesche, H Structure-based design and synthesis of potent matrix metalloproteinase inhibitors derived from a 6H-1,3,4-thiadiazine scaffold. J Med Chem44:3231-43 (2001) Matrix metalloproteinase-9
Name:Matrix metalloproteinase-9
Type:Enzyme
Mol. Mass.:78452.28
Organism:Homo sapiens (Human)
Description:P14780
Residue:707
BDBM50104708
NameBDBM50104708
Synonyms:(S)-N-(5-(4-methoxyphenyl)-6H-1,3,4-thiadiazin-2-yl)-2-(phenylsulfonamido)propanamide CHEMBL419750
TypeSmall organic molecule
Emp. Form.C19H20N4O4S2
Mol. Mass.432.516
SMILESCOc1ccc(cc1)C1=NN=C(NC(=O)[C@H](C)NS(=O)(=O)c2ccccc2)SC1