Reaction Details
TargetCollagenase 3
LigandBDBM50104711
Substrate/Competitorn/a
Meas. Tech.ChEMBL_106610 (CHEMBL717447)
Ki 470±n/a nM
Citation Schröder, JHenke, AWenzel, HBrandstetter, HStammler, HGStammler, APfeiffer, WDTschesche, H Structure-based design and synthesis of potent matrix metalloproteinase inhibitors derived from a 6H-1,3,4-thiadiazine scaffold. J Med Chem44:3231-43 (2001) Collagenase 3
Name:Collagenase 3
Type:Enzyme
Mol. Mass.:53808.06
Organism:Homo sapiens (Human)
Description:P45452
Residue:471
BDBM50104711
NameBDBM50104711
Synonyms:2-Benzenesulfonylamino-N-[5-(5-chloro-thiophen-2-yl)-6H-[1,3,4]thiadiazin-2-yl]-propionamide | CHEMBL111678
TypeSmall organic molecule
Emp. Form.C16H15ClN4O3S3
Mol. Mass.442.963
SMILESC[C@H](NS(=O)(=O)c1ccccc1)C(=O)NC1=NN=C(CS1)c1ccc(Cl)s1