Reaction Details
Target72 kDa type IV collagenase
LigandBDBM50104709
Substrate/Competitorn/a
Meas. Tech.ChEMBL_104405 (CHEMBL715008)
Ki 210±n/a nM
Citation Schröder, JHenke, AWenzel, HBrandstetter, HStammler, HGStammler, APfeiffer, WDTschesche, H Structure-based design and synthesis of potent matrix metalloproteinase inhibitors derived from a 6H-1,3,4-thiadiazine scaffold. J Med Chem44:3231-43 (2001) 72 kDa type IV collagenase
Name:72 kDa type IV collagenase
Type:Enzyme
Mol. Mass.:73870.36
Organism:Homo sapiens (Human)
Description: P08253
Residue:660
BDBM50104709
NameBDBM50104709
Synonyms:(R)-N-(5-(4-cyanophenyl)-6H-1,3,4-thiadiazin-2-yl)-2-(phenylsulfonamido)propanamide CHEMBL111450
TypeSmall organic molecule
Emp. Form.C19H17N5O3S2
Mol. Mass.427.5
SMILESC[C@@H](NS(=O)(=O)c1ccccc1)C(=O)NC1=NN=C(CS1)c1ccc(cc1)C#N