Reaction Details
TargetInterstitial collagenase
LigandBDBM50104723
Substrate/Competitorn/a
Meas. Tech.ChEMBL_106137 (CHEMBL718684)
Ki 300±n/a nM
Citation Schröder, JHenke, AWenzel, HBrandstetter, HStammler, HGStammler, APfeiffer, WDTschesche, H Structure-based design and synthesis of potent matrix metalloproteinase inhibitors derived from a 6H-1,3,4-thiadiazine scaffold. J Med Chem44:3231-43 (2001) Interstitial collagenase
Name:Interstitial collagenase
Type:Enzyme
Mol. Mass.:54010.26
Organism:Homo sapiens (Human)
Description: P03956
Residue:469
BDBM50104723
NameBDBM50104723
Synonyms:2-Benzenesulfonylamino-N-[5-(4-chloro-phenyl)-6H-[1,3,4]thiadiazin-2-yl]-2-methyl-propionamide | CHEMBL109806
TypeSmall organic molecule
Emp. Form.C19H19ClN4O3S2
Mol. Mass.450.962
SMILESCC(C)(NS(=O)(=O)c1ccccc1)C(=O)NC1=NN=C(CS1)c1ccc(Cl)cc1