Reaction Details
TargetCollagenase 3
LigandBDBM50104723
Substrate/Competitorn/a
Meas. Tech.ChEMBL_106610 (CHEMBL717447)
Ki 180±n/a nM
Citation Schröder, JHenke, AWenzel, HBrandstetter, HStammler, HGStammler, APfeiffer, WDTschesche, H Structure-based design and synthesis of potent matrix metalloproteinase inhibitors derived from a 6H-1,3,4-thiadiazine scaffold. J Med Chem44:3231-43 (2001) Collagenase 3
Name:Collagenase 3
Type:Enzyme
Mol. Mass.:53808.06
Organism:Homo sapiens (Human)
Description:P45452
Residue:471
BDBM50104723
NameBDBM50104723
Synonyms:2-Benzenesulfonylamino-N-[5-(4-chloro-phenyl)-6H-[1,3,4]thiadiazin-2-yl]-2-methyl-propionamide | CHEMBL109806
TypeSmall organic molecule
Emp. Form.C19H19ClN4O3S2
Mol. Mass.450.962
SMILESCC(C)(NS(=O)(=O)c1ccccc1)C(=O)NC1=NN=C(CS1)c1ccc(Cl)cc1