Reaction Details
TargetCollagenase 3
LigandBDBM50104704
Substrate/Competitorn/a
Meas. Tech.ChEMBL_106610 (CHEMBL717447)
Ki 650±n/a nM
Citation Schröder, JHenke, AWenzel, HBrandstetter, HStammler, HGStammler, APfeiffer, WDTschesche, H Structure-based design and synthesis of potent matrix metalloproteinase inhibitors derived from a 6H-1,3,4-thiadiazine scaffold. J Med Chem44:3231-43 (2001) Collagenase 3
Name:Collagenase 3
Type:Enzyme
Mol. Mass.:53808.06
Organism:Homo sapiens (Human)
Description:P45452
Residue:471
BDBM50104704
NameBDBM50104704
Synonyms:(S)-N-(5-(4-fluorophenyl)-6H-1,3,4-thiadiazin-2-yl)-2-(phenylsulfonamido)propanamide CHEMBL109579
TypeSmall organic molecule
Emp. Form.C18H17FN4O3S2
Mol. Mass.420.481
SMILESC[C@H](NS(=O)(=O)c1ccccc1)C(=O)NC1=NN=C(CS1)c1ccc(F)cc1