Reaction Details
Target5-hydroxytryptamine receptor 2A
LigandBDBM50104814
Substrate/Competitorn/a
Meas. Tech.ChEMBL_2619 (CHEMBL621531)
Ki 23±n/a nM
Citation Rangisetty, JBDukat, MDowd, CSHerrick-Davis, KDuPre, AGadepalli, STeitler, MKelley, CRSharif, NAGlennon, RA 1-[2-methoxy-5-(3-phenylpropyl)]-2-aminopropane unexpectedly shows 5-HT(2A) serotonin receptor affinity and antagonist character. J Med Chem44:3283-91 (2001) 5-hydroxytryptamine receptor 2A
Name:5-hydroxytryptamine receptor 2A
Type:G Protein-Coupled Receptor (GPCR)
Mol. Mass.:52852.05
Organism:Rattus norvegicus (rat)
Description:Rat cortex membranes 5-HT2A receptors.
Residue:471
BDBM50104814
NameBDBM50104814
Synonyms:2-(4-Benzyl-2-methoxy-phenyl)-ethylamine | CHEMBL111061
TypeSmall organic molecule
Emp. Form.C16H19NO
Mol. Mass.241.3282
SMILESCOc1cc(Cc2ccccc2)ccc1CCN