Reaction Details
Target5-hydroxytryptamine receptor 2A
LigandBDBM50104829
Substrate/Competitorn/a
Meas. Tech.ChEMBL_2618 (CHEMBL621530)
Ki 42±n/a nM
Citation Rangisetty, JBDukat, MDowd, CSHerrick-Davis, KDuPre, AGadepalli, STeitler, MKelley, CRSharif, NAGlennon, RA 1-[2-methoxy-5-(3-phenylpropyl)]-2-aminopropane unexpectedly shows 5-HT(2A) serotonin receptor affinity and antagonist character. J Med Chem44:3283-91 (2001) 5-hydroxytryptamine receptor 2A
Name:5-hydroxytryptamine receptor 2A
Type:G Protein-Coupled Receptor (GPCR)
Mol. Mass.:52852.05
Organism:Rattus norvegicus (rat)
Description:Rat cortex membranes 5-HT2A receptors.
Residue:471
BDBM50104829
NameBDBM50104829
Synonyms:2-[2-Methoxy-4-(4-phenyl-butyl)-phenyl]-ethylamine | CHEMBL110740
TypeSmall organic molecule
Emp. Form.C19H25NO
Mol. Mass.283.4079
SMILESCOc1cc(CCCCc2ccccc2)ccc1CCN