Reaction Details
TargetC-C chemokine receptor type 5
LigandBDBM50104942
Substrate/Competitorn/a
Meas. Tech.ChEMBL_39638 (CHEMBL649944)
Ki 1±n/a nM
Citation Palani, AShapiro, SClader, JWGreenlee, WJCox, KStrizki, JEndres, MBaroudy, BM Discovery of 4-[(Z)-(4-bromophenyl)- (ethoxyimino)methyl]-1'-[(2,4-dimethyl-3- pyridinyl)carbonyl]-4'-methyl-1,4'- bipiperidine N-oxide (SCH 351125): an orally bioavailable human CCR5 antagonist for the treatment of HIV infection. J Med Chem44:3339-42 (2001) C-C chemokine receptor type 5
Name:C-C chemokine receptor type 5
Type:Enzyme
Mol. Mass.:40540.21
Organism:Homo sapiens (Human)
Description:P51681
Residue:352
BDBM50104942
NameBDBM50104942
Synonyms:(4-Fluoro-naphthalen-1-yl)-{4-[4-(4-methoxy-benzenesulfonyl)-benzyl]-[1,4']bipiperidinyl-1'-yl}-methanone | CHEMBL109051
TypeSmall organic molecule
Emp. Form.C35H37FN2O4S
Mol. Mass.600.743
SMILESCOc1ccc(cc1)S(=O)(=O)c1ccc(CC2CCN(CC2)C2CCN(CC2)C(=O)c2ccc(F)c3ccccc23)cc1