Reaction Details
TargetC-C chemokine receptor type 5
LigandBDBM50104947
Substrate/Competitorn/a
Meas. Tech.ChEMBL_39651 (CHEMBL649956)
Ki 23±n/a nM
Citation Tagat, JRSteensma, RWMcCombie, SWNazareno, DVLin, SINeustadt, BRCox, KXu, SWojcik, LMurray, MGVantuno, NBaroudy, BMStrizki, JM Piperazine-based CCR5 antagonists as HIV-1 inhibitors. II. Discovery of 1-[(2,4-dimethyl-3-pyridinyl)carbonyl]-4- methyl-4-[3(S)-methyl-4-[1(S)-[4-(trifluoromethyl)phenyl]ethyl]-1-piperazinyl]- piperidine N1-oxide (Sch-350634), an orally bioavailable, potent CCR5 antagonist. J Med Chem44:3343-6 (2001) C-C chemokine receptor type 5
Name:C-C chemokine receptor type 5
Type:Enzyme
Mol. Mass.:40540.21
Organism:Homo sapiens (Human)
Description:P51681
Residue:352
BDBM50104947
NameBDBM50104947
Synonyms:(4-{4-[1-(4-Bromo-phenyl)-ethyl]-3-methyl-piperazin-1-yl}-piperidin-1-yl)-(2,6-dimethyl-phenyl)-methanone | CHEMBL322817
TypeSmall organic molecule
Emp. Form.C27H36BrN3O
Mol. Mass.498.498
SMILESC[C@H](N1CCN(C[C@@H]1C)C1CCN(CC1)C(=O)c1c(C)cccc1C)c1ccc(Br)cc1