Reaction Details
TargetC-C chemokine receptor type 5
LigandBDBM50104950
Substrate/Competitorn/a
Meas. Tech.ChEMBL_39651 (CHEMBL649956)
Ki 3±n/a nM
Citation Tagat, JRSteensma, RWMcCombie, SWNazareno, DVLin, SINeustadt, BRCox, KXu, SWojcik, LMurray, MGVantuno, NBaroudy, BMStrizki, JM Piperazine-based CCR5 antagonists as HIV-1 inhibitors. II. Discovery of 1-[(2,4-dimethyl-3-pyridinyl)carbonyl]-4- methyl-4-[3(S)-methyl-4-[1(S)-[4-(trifluoromethyl)phenyl]ethyl]-1-piperazinyl]- piperidine N1-oxide (Sch-350634), an orally bioavailable, potent CCR5 antagonist. J Med Chem44:3343-6 (2001) C-C chemokine receptor type 5
Name:C-C chemokine receptor type 5
Type:Enzyme
Mol. Mass.:40540.21
Organism:Homo sapiens (Human)
Description:P51681
Residue:352
BDBM50104950
NameBDBM50104950
Synonyms:(2,6-Dimethyl-phenyl)-(4-{(S)-4-[(S)-1-(4-methanesulfonyl-phenyl)-ethyl]-3-methyl-piperazin-1-yl}-4-methyl-piperidin-1-yl)-methanone CHEMBL113072
TypeSmall organic molecule
Emp. Form.C29H41N3O3S
Mol. Mass.511.719
SMILESC[C@H](N1CCN(C[C@@H]1C)C1(C)CCN(CC1)C(=O)c1c(C)cccc1C)c1ccc(cc1)S(C)(=O)=O