Reaction Details
TargetC-C chemokine receptor type 5
LigandBDBM50104960
Substrate/Competitorn/a
Meas. Tech.ChEMBL_39651 (CHEMBL649956)
Ki 62±n/a nM
Citation Tagat, JRSteensma, RWMcCombie, SWNazareno, DVLin, SINeustadt, BRCox, KXu, SWojcik, LMurray, MGVantuno, NBaroudy, BMStrizki, JM Piperazine-based CCR5 antagonists as HIV-1 inhibitors. II. Discovery of 1-[(2,4-dimethyl-3-pyridinyl)carbonyl]-4- methyl-4-[3(S)-methyl-4-[1(S)-[4-(trifluoromethyl)phenyl]ethyl]-1-piperazinyl]- piperidine N1-oxide (Sch-350634), an orally bioavailable, potent CCR5 antagonist. J Med Chem44:3343-6 (2001) C-C chemokine receptor type 5
Name:C-C chemokine receptor type 5
Type:Enzyme
Mol. Mass.:40540.21
Organism:Homo sapiens (Human)
Description:P51681
Residue:352
BDBM50104960
NameBDBM50104960
Synonyms:(2,6-Dimethyl-phenyl)-{4-[4-(4-iodo-benzyl)-piperazin-1-yl]-4-methyl-piperidin-1-yl}-methanone | CHEMBL113648
TypeSmall organic molecule
Emp. Form.C26H34IN3O
Mol. Mass.531.4721
SMILESCc1cccc(C)c1C(=O)N1CCC(C)(CC1)N1CCN(Cc2ccc(I)cc2)CC1