Reaction Details
TargetC-C chemokine receptor type 5
LigandBDBM50104961
Substrate/Competitorn/a
Meas. Tech.ChEMBL_39651 (CHEMBL649956)
Ki 30±n/a nM
Citation Tagat, JRSteensma, RWMcCombie, SWNazareno, DVLin, SINeustadt, BRCox, KXu, SWojcik, LMurray, MGVantuno, NBaroudy, BMStrizki, JM Piperazine-based CCR5 antagonists as HIV-1 inhibitors. II. Discovery of 1-[(2,4-dimethyl-3-pyridinyl)carbonyl]-4- methyl-4-[3(S)-methyl-4-[1(S)-[4-(trifluoromethyl)phenyl]ethyl]-1-piperazinyl]- piperidine N1-oxide (Sch-350634), an orally bioavailable, potent CCR5 antagonist. J Med Chem44:3343-6 (2001) C-C chemokine receptor type 5
Name:C-C chemokine receptor type 5
Type:Enzyme
Mol. Mass.:40540.21
Organism:Homo sapiens (Human)
Description:P51681
Residue:352
BDBM50104961
NameBDBM50104961
Synonyms:(2,6-Dimethyl-phenyl)-{4-[(S)-4-(4-iodo-benzyl)-3-methyl-piperazin-1-yl]-piperidin-1-yl}-methanone CHEMBL116008
TypeSmall organic molecule
Emp. Form.C26H34IN3O
Mol. Mass.531.4721
SMILESC[C@H]1CN(CCN1Cc1ccc(I)cc1)C1CCN(CC1)C(=O)c1c(C)cccc1C