Reaction Details
TargetNeutrophil collagenase
LigandBDBM50104969
Substrate/Competitorn/a
Meas. Tech.ChEMBL_105198 (CHEMBL713837)
Ki 0.700000±n/a nM
Citation Yao, WWasserman, ZRChao, MReddy, GShi, ELiu, RQCovington, MBArner, ECPratta, MATortorella, MMagolda, RLNewton, RQian, MRibadeneira, MDChrist, DWexler, RRDecicco, CP Design and synthesis of a series of (2R)-N(4)-hydroxy-2-(3-hydroxybenzyl)-N(1)- [(1S,2R)-2-hydroxy-2,3-dihydro-1H-inden-1-yl]butanediamide derivatives as potent, selective, and orally bioavailable aggrecanase inhibitors. J Med Chem44:3347-50 (2001) Neutrophil collagenase
Name:Neutrophil collagenase
Type:Enzyme
Mol. Mass.:53413.48
Organism:Homo sapiens (Human)
Description:P22894
Residue:467
BDBM50104969
NameBDBM50104969
Synonyms:(R)-N*4*-Hydroxy-2-isobutyl-N*1*-[(S)-2-(4-methoxy-phenyl)-1-methylcarbamoyl-ethyl]-succinamide N*4*-Hydroxy-2-isobutyl-N*1*-[2-(4-methoxy-phenyl)-1-methylcarbamoyl-ethyl]-succinamide SC-44463
TypeSmall organic molecule
Emp. Form.C19H29N3O5
Mol. Mass.379.4507
SMILESCNC(=O)[C@H](Cc1ccc(OC)cc1)NC(=O)[C@H](CC(C)C)CC(=O)NO