Reaction Details
TargetDisintegrin and metalloproteinase domain-containing protein 17
LigandBDBM50104976
Substrate/Competitorn/a
Meas. Tech.ChEMBL_206141 (CHEMBL814098)
Ki 4.6±n/a nM
Citation Xue, CBHe, XCorbett, RLRoderick, JWasserman, ZRLiu, RQJaffee, BDCovington, MBQian, MTrzaskos, JMNewton, RCMagolda, RLWexler, RRDecicco, CP Discovery of macrocyclic hydroxamic acids containing biphenylmethyl derivatives at P1', a series of selective TNF-alpha converting enzyme inhibitors with potent cellular activity in the inhibition of TNF-alpha release. J Med Chem44:3351-4 (2001) Disintegrin and metalloproteinase domain-containing protein 17
Name:Disintegrin and metalloproteinase domain-containing protein 17
Type:Metalloprotease
Mol. Mass.:12197.99
Organism:Sus scrofa (pig)
Description:Partially purified TACE was obtained from porcine spleen.
Residue:112
BDBM50104976
NameBDBM50104976
Synonyms:11-(3',5'-Bis-trifluoromethyl-biphenyl-4-ylmethyl)-2,10-dioxo-1-oxa-3,9-diaza-cyclopentadecane-8,12-dicarboxylic acid 12-hydroxyamide 8-[(2-oxo-2-piperazin-1-yl-ethyl)-amide] | CHEMBL114878
TypeSmall organic molecule
Emp. Form.C35H42F6N6O7
Mol. Mass.772.7344
SMILESONC(=O)[C@H]1CCCOC(=O)NCCCC[C@H](NC(=O)[C@@H]1Cc1ccc(cc1)-c1cc(cc(c1)C(F)(F)F)C(F)(F)F)C(=O)NCC(=O)N1CCNCC1