Reaction Details
Target72 kDa type IV collagenase
LigandBDBM50102608
Substrate/Competitorn/a
Meas. Tech.ChEMBL_104537 (CHEMBL872559)
Ki 1.1±n/a nM
Citation Xue, CBHe, XCorbett, RLRoderick, JWasserman, ZRLiu, RQJaffee, BDCovington, MBQian, MTrzaskos, JMNewton, RCMagolda, RLWexler, RRDecicco, CP Discovery of macrocyclic hydroxamic acids containing biphenylmethyl derivatives at P1', a series of selective TNF-alpha converting enzyme inhibitors with potent cellular activity in the inhibition of TNF-alpha release. J Med Chem44:3351-4 (2001) 72 kDa type IV collagenase
Name:72 kDa type IV collagenase
Type:Enzyme
Mol. Mass.:73870.36
Organism:Homo sapiens (Human)
Description: P08253
Residue:660
BDBM50102608
NameBDBM50102608
Synonyms:11-Isobutyl-2,10-dioxo-1-oxa-3,9-diaza-cyclopentadecane-8,12-dicarboxylic acid 12-hydroxyamide 8-[(2-morpholin-4-yl-2-oxo-ethyl)-amide] CHEMBL91636
TypeSmall organic molecule
Emp. Form.C24H41N5O8
Mol. Mass.527.611
SMILESCC(C)C[C@@H]1[C@H](CCCOC(=O)NCCCC[C@H](NC1=O)C(=O)NCC(=O)N1CCOCC1)C(=O)NO