Reaction Details
TargetEndothelin-1 receptor
LigandBDBM50104987
Substrate/Competitorn/a
Meas. Tech.ChEMBL_63352 (CHEMBL679117)
IC50 0.25±n/a nM
Citation Morimoto, HShimadzu, HKushiyama, EKawanishi, HHosaka, TKawase, YYasuda, KKikkawa, KYamauchi-Kohno, RYamada, K Potent and selective ET-A antagonists. 1. Syntheses and structure-activity relationships of N-(6-(2-(aryloxy)ethoxy)-4-pyrimidinyl)sulfonamide derivatives. J Med Chem44:3355-68 (2001) Endothelin-1 receptor
Name:Endothelin-1 receptor
Type:Enzyme Catalytic Domain
Mol. Mass.:48256.91
Organism:RAT
Description:ENDOTHELIN A EDNRA RAT::P26684
Residue:426
BDBM50104987
NameBDBM50104987
Synonyms:CHEMBL367445 | sodium salt of 4-tert-Butyl-N-{6-[2-(5-thiophen-2-yl-pyrimidin-2-yloxy)-ethoxy]-5-p-tolyl-pyrimidin-4-yl}-benzenesulfonamide
TypeSmall organic molecule
Emp. Form.C31H30N5O4S2
Mol. Mass.600.732
SMILESCc1ccc(cc1)-c1c([N-]S(=O)(=O)c2ccc(cc2)C(C)(C)C)ncnc1OCCOc1ncc(cn1)-c1cccs1