Reaction Details
TargetEndothelin-1 receptor
LigandBDBM50104995
Substrate/Competitorn/a
Meas. Tech.ChEMBL_63352 (CHEMBL679117)
IC50 0.039±n/a nM
Citation Morimoto, HShimadzu, HKushiyama, EKawanishi, HHosaka, TKawase, YYasuda, KKikkawa, KYamauchi-Kohno, RYamada, K Potent and selective ET-A antagonists. 1. Syntheses and structure-activity relationships of N-(6-(2-(aryloxy)ethoxy)-4-pyrimidinyl)sulfonamide derivatives. J Med Chem44:3355-68 (2001) Endothelin-1 receptor
Name:Endothelin-1 receptor
Type:Enzyme Catalytic Domain
Mol. Mass.:48256.91
Organism:RAT
Description:ENDOTHELIN A EDNRA RAT::P26684
Residue:426
BDBM50104995
NameBDBM50104995
Synonyms:CHEMBL369489 | sodium salt of N-{6-[2-(5-Bromo-pyrimidin-2-yloxy)-ethoxy]-5-p-tolyl-pyrimidin-4-yl}-4-tert-butyl-benzenesulfonamide
TypeSmall organic molecule
Emp. Form.C27H27BrN5O4S
Mol. Mass.597.504
SMILESCc1ccc(cc1)-c1c([N-]S(=O)(=O)c2ccc(cc2)C(C)(C)C)ncnc1OCCOc1ncc(Br)cn1