Reaction Details
TargetEndothelin-1 receptor
LigandBDBM50105003
Substrate/Competitorn/a
Meas. Tech.ChEMBL_65802 (CHEMBL679705)
IC50 0.37±n/a nM
Citation Morimoto, HShimadzu, HKushiyama, EKawanishi, HHosaka, TKawase, YYasuda, KKikkawa, KYamauchi-Kohno, RYamada, K Potent and selective ET-A antagonists. 1. Syntheses and structure-activity relationships of N-(6-(2-(aryloxy)ethoxy)-4-pyrimidinyl)sulfonamide derivatives. J Med Chem44:3355-68 (2001) Endothelin-1 receptor
Name:Endothelin-1 receptor
Type:PROTEIN
Mol. Mass.:48707.29
Organism:Sus scrofa
Description:ChEMBL_65803
Residue:427
BDBM50105003
NameBDBM50105003
Synonyms:4-tert-Butyl-N-{5-(2-methoxy-phenoxy)-6-[2-(5-methylsulfanyl-pyrimidin-2-yloxy)-ethoxy]-pyrimidin-4-yl}-benzenesulfonamide | CHEMBL114660
TypeSmall organic molecule
Emp. Form.C28H31N5O6S2
Mol. Mass.597.706
SMILESCOc1ccccc1Oc1c(NS(=O)(=O)c2ccc(cc2)C(C)(C)C)ncnc1OCCOc1ncc(SC)cn1