Reaction Details
TargetEndothelin receptor type B
LigandBDBM50105027
Substrate/Competitorn/a
Meas. Tech.ChEMBL_63684 (CHEMBL670642)
IC50 28±n/a nM
Citation Morimoto, HShimadzu, HKushiyama, EKawanishi, HHosaka, TKawase, YYasuda, KKikkawa, KYamauchi-Kohno, RYamada, K Potent and selective ET-A antagonists. 1. Syntheses and structure-activity relationships of N-(6-(2-(aryloxy)ethoxy)-4-pyrimidinyl)sulfonamide derivatives. J Med Chem44:3355-68 (2001) Endothelin receptor type B
Name:Endothelin receptor type B
Type:Enzyme Catalytic Domain
Mol. Mass.:49664.00
Organism:Homo sapiens (Human)
Description:ENDOTHELIN B EDNRB HUMAN::P24530
Residue:442
BDBM50105027
NameBDBM50105027
Synonyms:CHEMBL176272 | sodium salt of 4-tert-Butyl-N-{6-[2-(5-chloro-pyrimidin-2-yloxy)-ethoxy]-5-p-tolyl-pyrimidin-4-yl}-benzenesulfonamide
TypeSmall organic molecule
Emp. Form.C27H27ClN5O4S
Mol. Mass.553.053
SMILESCc1ccc(cc1)-c1c([N-]S(=O)(=O)c2ccc(cc2)C(C)(C)C)ncnc1OCCOc1ncc(Cl)cn1