Reaction Details
TargetEndothelin-1 receptor
LigandBDBM50105041
Substrate/Competitorn/a
Meas. Tech.ChEMBL_65802 (CHEMBL679705)
IC50 0.64±n/a nM
Citation Morimoto, HShimadzu, HKushiyama, EKawanishi, HHosaka, TKawase, YYasuda, KKikkawa, KYamauchi-Kohno, RYamada, K Potent and selective ET-A antagonists. 1. Syntheses and structure-activity relationships of N-(6-(2-(aryloxy)ethoxy)-4-pyrimidinyl)sulfonamide derivatives. J Med Chem44:3355-68 (2001) Endothelin-1 receptor
Name:Endothelin-1 receptor
Type:PROTEIN
Mol. Mass.:48707.29
Organism:Sus scrofa
Description:ChEMBL_65803
Residue:427
BDBM50105041
NameBDBM50105041
Synonyms:CHEMBL112162 | N-{6-[2-(5-Bromo-pyrimidin-2-yloxy)-ethoxy]-5-p-tolyl-pyrimidin-4-yl}-3,4-dimethoxy-benzenesulfonamide
TypeSmall organic molecule
Emp. Form.C25H24BrN5O6S
Mol. Mass.602.457
SMILESCOc1ccc(cc1OC)S(=O)(=O)Nc1ncnc(OCCOc2ncc(Br)cn2)c1-c1ccc(C)cc1