Reaction Details
TargetIntercellular adhesion molecule 1
LigandBDBM50105211
Substrate/Competitorn/a
Meas. Tech.ChEMBL_89057 (CHEMBL698938)
IC50 23±n/a nM
Citation Zhu, GDArendsen, DLGunawardana, IWBoyd, SAStewart, AOFry, DGCool, BLKifle, LSchaefer, VMeuth, JMarsh, KCKempf-Grote, AJKilgannon, PGallatin, WMOkasinski, GF Selective inhibition of ICAM-1 and E-selectin expression in human endothelial cells. 2. Aryl modifications of 4-(aryloxy)thieno[2,3-c]pyridines with fine-tuning at C-2 carbamides. J Med Chem44:3469-87 (2001) Intercellular adhesion molecule 1
Name:Intercellular adhesion molecule 1
Type:PROTEIN
Mol. Mass.:57831.10
Organism:Homo sapiens (Human)
Description:ChEMBL_826675
Residue:532
BDBM50105211
NameBDBM50105211
Synonyms:4-(4-Hydroxymethyl-phenoxy)-thieno[2,3-c]pyridine-2-carboxylic acid amide | CHEMBL118022
TypeSmall organic molecule
Emp. Form.C15H12N2O3S
Mol. Mass.300.332
SMILESNC(=O)c1cc2c(Oc3ccc(CO)cc3)cncc2s1