Reaction Details
TargetE-selectin
LigandBDBM50105207
Substrate/Competitorn/a
Meas. Tech.ChEMBL_199699 (CHEMBL802927)
IC50 7±n/a nM
Citation Zhu, GDArendsen, DLGunawardana, IWBoyd, SAStewart, AOFry, DGCool, BLKifle, LSchaefer, VMeuth, JMarsh, KCKempf-Grote, AJKilgannon, PGallatin, WMOkasinski, GF Selective inhibition of ICAM-1 and E-selectin expression in human endothelial cells. 2. Aryl modifications of 4-(aryloxy)thieno[2,3-c]pyridines with fine-tuning at C-2 carbamides. J Med Chem44:3469-87 (2001) E-selectin
Name:E-selectin
Type:PROTEIN
Mol. Mass.:66642.96
Organism:Homo sapiens (Human)
Description:ChEMBL_1438995
Residue:610
BDBM50105207
NameBDBM50105207
Synonyms:4-[4-(2-Methoxy-ethoxymethyl)-phenoxy]-thieno[2,3-c]pyridine-2-carboxylic acid methylamide | CHEMBL331584
TypeSmall organic molecule
Emp. Form.C19H20N2O4S
Mol. Mass.372.438
SMILESCNC(=O)c1cc2c(Oc3ccc(COCCOC)cc3)cncc2s1