Reaction Details
TargetIntercellular adhesion molecule 1
LigandBDBM50105162
Substrate/Competitorn/a
Meas. Tech.ChEMBL_89061 (CHEMBL698941)
IC50 6±n/a nM
Citation Zhu, GDArendsen, DLGunawardana, IWBoyd, SAStewart, AOFry, DGCool, BLKifle, LSchaefer, VMeuth, JMarsh, KCKempf-Grote, AJKilgannon, PGallatin, WMOkasinski, GF Selective inhibition of ICAM-1 and E-selectin expression in human endothelial cells. 2. Aryl modifications of 4-(aryloxy)thieno[2,3-c]pyridines with fine-tuning at C-2 carbamides. J Med Chem44:3469-87 (2001) Intercellular adhesion molecule 1
Name:Intercellular adhesion molecule 1
Type:PROTEIN
Mol. Mass.:57831.10
Organism:Homo sapiens (Human)
Description:ChEMBL_826675
Residue:532
BDBM50105162
NameBDBM50105162
Synonyms:4-(4-Bromo-phenoxy)-thieno[2,3-c]pyridine-2-carboxylic acid amide | CHEMBL116070
TypeSmall organic molecule
Emp. Form.C14H9BrN2O2S
Mol. Mass.349.202
SMILESNC(=O)c1cc2c(Oc3ccc(Br)cc3)cncc2s1