Reaction Details
TargetCalpain-1 catalytic subunit
LigandBDBM50105229
Substrate/Competitorn/a
Meas. Tech.ChEMBL_43496 (CHEMBL877099)
IC50 6±n/a nM
Citation Wells, GJTao, MJosef, KABihovsky, R 1,2-Benzothiazine 1,1-dioxide P(2)-P(3) peptide mimetic aldehyde calpain I inhibitors. J Med Chem44:3488-503 (2001) Calpain-1 catalytic subunit
Name:Calpain-1 catalytic subunit
Type:Protein
Mol. Mass.:81880.51
Organism:Homo sapiens (Human)
Description:n/a
Residue:714
BDBM50105229
NameBDBM50105229
Synonyms:2-Methyl-1,1-dioxo-1,2,6,7-tetrahydro-5,8-dioxa-1lambda*6*-thia-2-aza-anthracene-3-carboxylic acid (1-benzyl-2-oxo-ethyl)-amide | CHEMBL326161
TypeSmall organic molecule
Emp. Form.C21H20N2O6S
Mol. Mass.428.458
SMILESCN1C(=Cc2cc3OCCOc3cc2S1(=O)=O)C(=O)N[C@@H](Cc1ccccc1)C=O