Reaction Details
TargetProteinase-activated receptor 1
LigandBDBM50105328
Substrate/Competitorn/a
Meas. Tech.ChEBML_209262
IC50 700±n/a nM
Citation Barrow, JCNantermet, PGSelnick, HGGlass, KLNgo, PLYoung, MBPellicore, JMBreslin, MJHutchinson, JHFreidinger, RMCondra, CKarczewski, JBednar, RAGaul, SLStern, AGould, RConnolly, TM Discovery and initial structure-activity relationships of trisubstituted ureas as thrombin receptor (PAR-1) antagonists. Bioorg Med Chem Lett11:2691-6 (2001) Proteinase-activated receptor 1
Name:Proteinase-activated receptor 1
Type:Protein
Mol. Mass.:47450.07
Organism:Homo sapiens (Human)
Description:P25116
Residue:425
BDBM50105328
NameBDBM50105328
Synonyms:CHEMBL313645 | N-(4-{3-[(S)-2-(3,4-Dichloro-phenyl)-2-hydroxy-ethyl]-3-isopropyl-ureido}-benzyl)-2,2-dimethyl-propionamide
TypeSmall organic molecule
Emp. Form.C24H31Cl2N3O3
Mol. Mass.480.427
SMILESCC(C)N(C[C@@H](O)c1ccc(Cl)c(Cl)c1)C(=O)Nc1ccc(CNC(=O)C(C)(C)C)cc1