Reaction Details
TargetIntegrin alpha-4/beta-1
LigandBDBM50105384
Substrate/Competitorn/a
Meas. Tech.ChEMBL_214674 (CHEMBL821412)
IC50 1.3±n/a nM
Citation Hagmann, WKDurette, PLLanza, TKevin, NJde Laszlo, SEKopka, IEYoung, DMagriotis, PALi, BLin, LSYang, GKamenecka, TChang, LLWilson, JMacCoss, MMills, SGVan Riper, GMcCauley, EEgger, LAKidambi, ULyons, KVincent, SStearns, RColletti, ATeffera, JTong, SFenyk-Melody, JOwens, KLevorse, DKim, PSchmidt, JAMumford, RA The discovery of sulfonylated dipeptides as potent VLA-4 antagonists. Bioorg Med Chem Lett11:2709-13 (2001) Integrin alpha-4/beta-1
Name:Integrin alpha-4/beta-1
Type:n/a
Mol. Mass.:n/a
Description:ASSAY_ID of EBI is 88912
Components:This complex has 2 components.
Component 1
Name:Integrin beta-1
Synonyms:CD_antigen=CD29 Fibronectin receptor beta GPIIA ITGB1 MDF2 | MSK12
Type:Enzyme
Mol. Mass.:88400.38
Organism:Homo sapiens (Human)
Description:P05556
Residue:798
Component 2
Name:Integrin alpha-4
Synonyms:CD49 antigen-like family member D CD49d antigen ITA4_HUMAN Integrin alpha-4 Integrin alpha-IV VLA-4 integrin alpha 4 precursor | integrin alpha-4 precursor
Type:Membrane Protein
Mol. Mass.:114897.35
Organism:Homo sapiens (Human)
Description:P13612
Residue:1032
BDBM50105384
NameBDBM50105384
Synonyms:(S)-2-{[(S)-1-(3,5-Dichloro-benzenesulfonyl)-2-methyl-pyrrolidine-2-carbonyl]-amino}-3-[4-(1H-indol-7-yl)-phenyl]-propionic acid | CHEMBL91030
TypeSmall organic molecule
Emp. Form.C29H27Cl2N3O5S
Mol. Mass.600.513
SMILESC[C@]1(CCCN1S(=O)(=O)c1cc(Cl)cc(Cl)c1)C(=O)N[C@@H](Cc1ccc(cc1)-c1cccc2cc[nH]c12)C(O)=O