Reaction Details
TargetAmine oxidase [flavin-containing] A
LigandBDBM50105418
Substrate/Competitorn/a
Meas. Tech.ChEMBL_124429 (CHEMBL733092)
IC50 2040±n/a nM
Citation Ling, LUrichuk, LJSloley, BDCoutts, RTBaker, GBShan, JJPang, PK Synthesis of N-propargylphenelzine and analogues as neuroprotective agents. Bioorg Med Chem Lett11:2715-7 (2001) Amine oxidase [flavin-containing] A
Name:Amine oxidase [flavin-containing] A
Type:Enzyme
Mol. Mass.:59515.21
Organism:Rattus norvegicus (rat)
Description:n/a
Residue:526
BDBM50105418
NameBDBM50105418
Synonyms:CHEMBL90144 | N-Phenethyl-N-prop-2-ynyl-hydrazine
TypeSmall organic molecule
Emp. Form.C11H14N2
Mol. Mass.174.2423
SMILESNN(CCc1ccccc1)CC#C