Reaction Details
TargetAmine oxidase [flavin-containing] A
LigandBDBM50105416
Substrate/Competitorn/a
Meas. Tech.ChEBML_124429
IC50 1170±n/a nM
Citation Ling, LUrichuk, LJSloley, BDCoutts, RTBaker, GBShan, JJPang, PK Synthesis of N-propargylphenelzine and analogues as neuroprotective agents. Bioorg Med Chem Lett11:2715-7 (2001) Amine oxidase [flavin-containing] A
Name:Amine oxidase [flavin-containing] A
Type:Enzyme
Mol. Mass.:59515.21
Organism:Rattus norvegicus (rat)
Description:n/a
Residue:526
BDBM50105416
NameBDBM50105416
Synonyms:CHEMBL328551 | N-((E)-3-Phenyl-allyl)-N-prop-2-ynyl-hydrazine
TypeSmall organic molecule
Emp. Form.C12H14N2
Mol. Mass.186.253
SMILESNN(C\C=C\c1ccccc1)CC#C