Reaction Details
TargetAmine oxidase [flavin-containing] B
LigandBDBM50105422
Substrate/Competitorn/a
Meas. Tech.ChEBML_123926
IC50 1010±n/a nM
Citation Ling, LUrichuk, LJSloley, BDCoutts, RTBaker, GBShan, JJPang, PK Synthesis of N-propargylphenelzine and analogues as neuroprotective agents. Bioorg Med Chem Lett11:2715-7 (2001) Amine oxidase [flavin-containing] B
Name:Amine oxidase [flavin-containing] B
Type:Enzyme
Mol. Mass.:58469.65
Organism:Rattus norvegicus (rat)
Description:P19643
Residue:520
BDBM50105422
NameBDBM50105422
Synonyms:CHEMBL328446 | N-Phenyl-N-prop-2-ynyl-hydrazine
TypeSmall organic molecule
Emp. Form.C9H10N2
Mol. Mass.146.1891
SMILESNN(CC#C)c1ccccc1