Reaction Details
TargetAmine oxidase [flavin-containing] A
LigandBDBM50105423
Substrate/Competitorn/a
Meas. Tech.ChEBML_124429
IC50 1560±n/a nM
Citation Ling, LUrichuk, LJSloley, BDCoutts, RTBaker, GBShan, JJPang, PK Synthesis of N-propargylphenelzine and analogues as neuroprotective agents. Bioorg Med Chem Lett11:2715-7 (2001) Amine oxidase [flavin-containing] A
Name:Amine oxidase [flavin-containing] A
Type:Enzyme
Mol. Mass.:59515.21
Organism:Rattus norvegicus (rat)
Description:n/a
Residue:526
BDBM50105423
NameBDBM50105423
Synonyms:CHEMBL90721 | N-Benzyl-N-prop-2-ynyl-hydrazine
TypeSmall organic molecule
Emp. Form.C10H12N2
Mol. Mass.160.2157
SMILESNN(CC#C)Cc1ccccc1