Reaction Details
TargetTelomerase reverse transcriptase
LigandBDBM50105462
Substrate/Competitorn/a
Meas. Tech.ChEMBL_210226 (CHEMBL816666)
IC50 12200±n/a nM
Citation West, CFrancis, RFriedman, SH Small molecule/nucleic acid affinity chromatography: application for the identification of telomerase inhibitors which target its key RNA/DNA heteroduplex. Bioorg Med Chem Lett11:2727-30 (2001) Telomerase reverse transcriptase
Name:Telomerase reverse transcriptase
Type:PROTEIN
Mol. Mass.:127099.03
Organism:Homo sapiens (Human)
Description:ChEMBL_1447029
Residue:1132
BDBM50105462
NameBDBM50105462
Synonyms:CHEMBL81880 | N,N,N',N'-Tetramethyl-acridine-3,6-diamine
TypeSmall organic molecule
Emp. Form.C17H19N3
Mol. Mass.265.3529
SMILESCN(C)c1ccc2cc3ccc(cc3nc2c1)N(C)C