Reaction Details
TargetTelomerase reverse transcriptase
LigandBDBM50105463
Substrate/Competitorn/a
Meas. Tech.ChEMBL_210225 (CHEMBL816665)
IC50 3300±n/a nM
Citation West, CFrancis, RFriedman, SH Small molecule/nucleic acid affinity chromatography: application for the identification of telomerase inhibitors which target its key RNA/DNA heteroduplex. Bioorg Med Chem Lett11:2727-30 (2001) Telomerase reverse transcriptase
Name:Telomerase reverse transcriptase
Type:PROTEIN
Mol. Mass.:127099.03
Organism:Homo sapiens (Human)
Description:ChEMBL_1447029
Residue:1132
BDBM50105463
NameBDBM50105463
Synonyms:2,7-diamino-10-ethyl-9-phenylphenanthridinium bromide 3,8-diamino-5-ethyl-6-phenylphenanthridinium bromide Dromilac Ethidium bromide | Homidium bromide
TypeSmall organic molecule
Emp. Form.C21H20N3
Mol. Mass.314.4031
SMILESCCn1c(-c2ccccc2)c2cc(N)ccc2c2ccc(=[NH2+])cc12