Reaction Details
TargetSomatostatin receptor type 2
LigandBDBM50105470
Substrate/Competitorn/a
Meas. Tech.ChEBML_200992
IC50 4.4±n/a nM
Citation Hay, BACole, BMDiCapua, FMKirk, GWMurray, MCNardone, RAPelletier, DJRicketts, APRobertson, ASSiegel, TW Small molecule somatostatin receptor subtype-2 antagonists. Bioorg Med Chem Lett11:2731-4 (2001) Somatostatin receptor type 2
Name:Somatostatin receptor type 2
Type:Enzyme
Mol. Mass.:41344.94
Organism:Homo sapiens (Human)
Description:P30874
Residue:369
BDBM50105470
NameBDBM50105470
Synonyms:(S)-6-Amino-2-((R)-3-(1H-indol-3-yl)-2-{[4-(4-methyl-benzoyl)-piperazine-1-carbonyl]-amino}-propionylamino)-hexanoic acid tert-butyl ester | CHEMBL94293
TypeSmall organic molecule
Emp. Form.C34H46N6O5
Mol. Mass.618.7662
SMILESCc1ccc(cc1)C(=O)N1CCN(CC1)C(=O)N[C@H](Cc1c[nH]c2ccccc12)C(=O)N[C@@H](CCCCN)C(=O)OC(C)(C)C