Reaction Details
TargetSomatostatin receptor type 2
LigandBDBM50105469
Substrate/Competitorn/a
Meas. Tech.ChEMBL_200991 (CHEMBL801242)
IC50 6.5±n/a nM
Citation Hay, BACole, BMDiCapua, FMKirk, GWMurray, MCNardone, RAPelletier, DJRicketts, APRobertson, ASSiegel, TW Small molecule somatostatin receptor subtype-2 antagonists. Bioorg Med Chem Lett11:2731-4 (2001) Somatostatin receptor type 2
Name:Somatostatin receptor type 2
Type:Enzyme
Mol. Mass.:41344.94
Organism:Homo sapiens (Human)
Description:P30874
Residue:369
BDBM50105469
NameBDBM50105469
Synonyms:(S)-6-Amino-2-((R)-3-(1H-indol-3-yl)-2-{[4-(2-oxo-2,3-dihydro-benzoimidazol-1-yl)-piperidine-1-carbonyl]-amino}-propionylamino)-hexanoic acid tert-butyl ester | CHEMBL93859
TypeSmall organic molecule
Emp. Form.C34H45N7O5
Mol. Mass.631.765
SMILESCC(C)(C)OC(=O)[C@H](CCCCN)NC(=O)[C@@H](Cc1c[nH]c2ccccc12)NC(=O)N1CCC(CC1)n1c2ccccc2[nH]c1=O