Reaction Details
TargetC-C chemokine receptor type 5
LigandBDBM50105555
Substrate/Competitorn/a
Meas. Tech.ChEBML_39629
IC50 0.800000±n/a nM
Citation Hale, JJBudhu, RJHolson, EBFinke, PEOates, BMills, SGMacCoss, MGould, SLDeMartino, JASpringer, MSSiciliano, SMalkowitz, LSchleif, WAHazuda, DMiller, MKessler, JDanzeisen, RHolmes, KLineberger, JCarella, ACarver, GEmini, E 1,3,4-Trisubstituted pyrrolidine CCR5 receptor antagonists. Part 2: lead optimization affording selective, orally bioavailable compounds with potent anti-HIV activity. Bioorg Med Chem Lett11:2741-5 (2001) C-C chemokine receptor type 5
Name:C-C chemokine receptor type 5
Type:Enzyme
Mol. Mass.:40540.21
Organism:Homo sapiens (Human)
Description:P51681
Residue:352
BDBM50105555
NameBDBM50105555
Synonyms:Allyl-{1-[(3S,4S)-1-(naphthalene-1-carbonyl)-4-phenyl-pyrrolidin-3-ylmethyl]-piperidin-4-yl}-carbamic acid 4-nitro-benzyl ester | CHEMBL327241
TypeSmall organic molecule
Emp. Form.C38H40N4O5
Mol. Mass.632.748
SMILES[O-][N+](=O)c1ccc(COC(=O)N(CC=C)C2CCN(C[C@H]3CN(C[C@@H]3c3ccccc3)C(=O)c3cccc4ccccc34)CC2)cc1